{"text_format":"1","workbook":"xlsx","n_sheets":3,"sheets":["Modelo","SELIC","Feriados"],"not_rendered":{"charts":0,"images":1,"macros":1,"external_links":0,"defined_names":3,"comments":0,"pivot_tables":0},"unopened":[],"bounds":{"document_bytes":16777216,"sheet_cells":100000,"rows_first":2000,"rows_last":500,"rows_between":2000,"halvings":0,"cell_chars":16384,"cell_head_chars":4096},"cells_cut":0,"cells_raw":0,"read":"whole","date_system":"1900"}

{"sheet":"Modelo","index":0,"n_rows":30,"n_cols":10,"rows_kept":30,"cut":false,"hidden":false,"merged":[[12,9,13,9],[4,0,4,9],[12,0,13,0],[12,1,13,1],[12,2,13,2],[12,3,12,6],[12,7,12,8],[9,0,9,8]]}
[]
[]
[]
[]
["MODELO - Deve ser adaptado utilizando os valores, taxas e prazos do contrato"]
[]
["Valores em Reais"]
["Data da Liberação","Liberação","Spread BNDES                        (% a.a.)","Sobretaxa Custo Financeiro  (% a.a.)","Taxa Cobrança BNDES (% a.a.)"]
["2025-01-15",654637.14,3.1,-0.25,{"$f":"C9+D9","v":2.85}]
["*Atualizar a sobretaxa na data da contratação da operação com a taxa disponível no site do BNDES, em Moedas Contratuais, Sigla: SOBRETAXA LCD (Cód: LD1)"]
[]
["Valores em Reais"]
["Data de Vencimento","Índice de \nAtualização","Principal\nAtualizado","Juros Compensatórios",null,null,null,"Amortização",null,"Prestação"]
[null,null,null,"Taxa ","Dias Úteis\n*","Multiplicador   ","Juros Compensatórios","N° de Parcelas Restantes\nRestantes","Valor"]
["2025-01-31",{"$f":"(1+VLOOKUP(A15,SELIC!$A$2:$B$6,2,2)%)^E15","v":1.0054752522211403},{"$f":"((B9)*ROUND(B15,15))","v":658221.44345482579},{"$f":"E9","v":2.85},{"$f":"NETWORKDAYS(A9,A15-1,feriados)","v":12},{"$f":"ROUND(B15*((1+D15%)^(E15/252)),15)","v":1.00682164298601},{"$f":"ROUND((B9)*F15,15)-C15","v":881.39739963726606}]
["2025-02-17",{"$f":"(1+VLOOKUP(A16,SELIC!$A$2:$B$6,2,2)%)^E16","v":1.0054073149257168},{"$f":"round_to_even((C15-I15)*ROUND(B16,15),2)","v":661780.65},{"$f":"D15","v":2.85},{"$f":"NETWORKDAYS(A15,A16-1,feriados)","v":11},1.0066413542464201,{"$f":"round_to_even((C15-I15+G15)*F16,2)-C16","v":1699.5300000000279},20,{"$f":"round_to_even(C16/H16,2)","v":33089.03},{"$f":"I16+G16","v":34788.560000000027}]
["2025-03-17",{"$f":"(1+VLOOKUP(A17,SELIC!$A$2:$B$6,2,2)%)^E17","v":1.0088635471951468},{"$f":"round_to_even((C16-I16)*ROUND(B17,15),2)","v":634264.06000000006},{"$f":"D16","v":2.85},{"$f":"NETWORKDAYS(A16,A17-1,feriados)","v":18},1.01089061724645,{"$f":"round_to_even((C16-I16)*F17,2)-C17","v":1274.3999999999069},{"$f":"H16-1","v":19},{"$f":"round_to_even(C17/H17,2)","v":33382.32},{"$f":"I17+G17","v":34656.719999999907}]
["2025-03-21",{"$f":"(1+VLOOKUP(A18,SELIC!$A$2:$B$6,2,2)%)^E18","v":1.0019629232481422},{"$f":"((C17-I17)*ROUND(B18,15))","v":602061.22473682894},{"$f":"D17","v":2.85},{"$f":"NETWORKDAYS(A17,A18-1,feriados)","v":4},{"$f":"ROUND(B18*((1+D18%)^(E18/252)),15)","v":1.00240995295737},{"$f":"ROUND((C17-I17)*F18,15)-C18","v":268.61198951408733}]
["2025-04-15",{"$f":"(1+VLOOKUP(A19,SELIC!$A$2:$B$6,2,2)%)^E19","v":1.0089678980350847},{"$f":"round_to_even((C18-I18)*ROUND(B19,15),2)","v":607460.44999999995},{"$f":"D17","v":2.85},17,1.0108824443166899,{"$f":"round_to_even((C18-I18+G18)*F19,2)-C19","v":1424.2100000000792},{"$f":"H17-1","v":18},{"$f":"round_to_even(C19/H19,2)","v":33747.800000000003},{"$f":"I19+G19","v":35172.010000000082}]
["2025-05-09",{"$f":"(1+VLOOKUP(A20,SELIC!$A$2:$B$6,2,2)%)^E20","v":1.0079086908732755},{"$f":"((C19-I19)*ROUND(B20,15))","v":578249.96599894017},{"$f":"D19","v":2.85},{"$f":"NETWORKDAYS(A19,A20-1,feriados)","v":15},{"$f":"ROUND(B20*((1+D20%)^(E20/252)),15)","v":1.0095960347669299},{"$f":"ROUND((C19-I19)*F20,15)-C20","v":968.05053668678738}]
["2025-05-15",{"$f":"(1+VLOOKUP(A21,SELIC!$A$2:$B$6,2,2)%)^E21","v":1.0021724075185503},{"$f":"round_to_even((C20-I20)*ROUND(B21,15),2)","v":579506.16},{"$f":"D19","v":2.85},4,1.0026195306900101,{"$f":"round_to_even((C20-I20+G20)*F21,2)-C21","v":1229.140000000014},{"$f":"H19-1","v":17},{"$f":"round_to_even(C21/H21,2)","v":34088.6},{"$f":"I21+G21","v":35317.740000000013}]
["2025-06-16",{"$f":"(1+VLOOKUP(A22,SELIC!$A$2:$B$6,2,2)%)^E22","v":1.0120067915826225},{"$f":"round_to_even((C21-I21)*ROUND(B22,15),2)","v":551966.27},{"$f":"D21","v":2.85},{"$f":"NETWORKDAYS(A21,A22-1,feriados)","v":22},1.0144925952556101,{"$f":"round_to_even((C21-I21)*F22,2)-C22","v":1355.8099999999395},{"$f":"H21-1","v":16},{"$f":"round_to_even(C22/H22,2)","v":34497.89},35853.699999999939]
["2025-06-23",{"$f":"(1+VLOOKUP(A23,SELIC!$A$2:$B$6,2,2)%)^E23","v":1.0021724075185503},{"$f":"((C22-I22)*ROUND(B23,15))","v":518592.53219932393},{"$f":"D22","v":2.85},{"$f":"NETWORKDAYS(A22,A23-1,feriados)","v":4},{"$f":"ROUND(B23*((1+D23%)^(E23/252)),15)","v":1.0026195306900101},{"$f":"ROUND((C22-I22)*F23,15)-C23","v":231.37210319604492}]
["2025-07-15",{"$f":"(1+VLOOKUP(A24,SELIC!$A$2:$B$6,2,2)%)^E24","v":1.008857527131618},{"$f":"round_to_even((C23-I23)*ROUND(B24,15),2)","v":523185.98},{"$f":"D22","v":2.85},16,1.0106591554445701,{"$f":"round_to_even((C23-I23+G23)*F24,2)-C24","v":1168.1500000000233},{"$f":"H22-1","v":15},{"$f":"round_to_even(C24/H24,2)","v":34879.07},{"$f":"I24+G24","v":36047.220000000023}]
["2025-08-15",{"$f":"(1+VLOOKUP(A24,SELIC!$A$2:$B$6,2,2)%)^E25","v":1.0127573250874791},{"$f":"round_to_even((C24-I24)*ROUND(B25,15),2)","v":494536.4},{"$f":"D24","v":2.85},{"$f":"NETWORKDAYS(A24,A25-1,feriados)","v":23},1.0153581922504999,{"$f":"round_to_even((C24-I24)*F25,2)-C25","v":1270.0199999999604},{"$f":"H24-1","v":14},{"$f":"round_to_even(C25/H25,2)","v":35324.03},36594.049999999959]
["2025-09-15",{"$f":"(1+VLOOKUP(A25,SELIC!$A$2:$B$6,2,2)%)^E26","v":1.0116415613879775},{"$f":"round_to_even((C25-I25)*ROUND(B26,15),2)","v":464558.32},{"$f":"D25","v":2.85},21,{"$f":"ROUND(B26*((1+D26%)^(E26/252)),15)","v":1.01401338534216},{"$f":"round_to_even((C25-I25)*F26,2)-C26","v":1089.1699999999837},{"$f":"H25-1","v":13},{"$f":"round_to_even(C26/H26,2)","v":35735.26},{"$f":"I26+G26","v":36824.429999999986}]
["2025-10-15",{"$f":"(1+VLOOKUP(A26,SELIC!$A$2:$B$6,2,2)%)^E27","v":1.0121992894971863},{"$f":"round_to_even((C26-I26)*ROUND(B27,15),2)","v":434054.40000000002},2.85,22,1.0146855660049701,{"$f":"round_to_even((C26-I26)*F27,2)-C27","v":1066.1699999999837},12,{"$f":"round_to_even(C27/H27,2)","v":36171.199999999997},37237.369999999981]
["2025-11-17",{"$f":"(1+VLOOKUP(A27,SELIC!$A$2:$B$6,2,2)%)^E28","v":1.0127573250874791},{"$f":"round_to_even((C27-I27)*ROUND(B28,15),2)","v":402959.13},2.85,23,1.0153581922504999,{"$f":"round_to_even((C27-I27)*F28,2)-C28","v":1034.8399999999674},11,{"$f":"round_to_even(C28/H28,2)","v":36632.65},37667.489999999969]
["2025-12-15",{"$f":"(1+VLOOKUP(A28,SELIC!$A$2:$B$6,2,2)%)^E29","v":1.0105270269352089},{"$f":"round_to_even((C28-I28)*ROUND(B29,15),2)","v":370182.81},2.85,19,1.0126703595841899,{"$f":"round_to_even((C28-I28)*F29,2)-C29","v":785.15999999997439},10,{"$f":"round_to_even(C29/H29,2)","v":37018.28},37803.439999999973]
["2026-01-15",{"$f":"(1+VLOOKUP(A29,SELIC!$A$2:$B$6,2,2)%)^E30","v":1.0116415613879775},{"$f":"round_to_even((C29-I29)*ROUND(B30,15),2)","v":337043.09},2.85,21,1.01401338534216,{"$f":"round_to_even((C29-I29)*F30,2)-C30","v":790.19999999995343},9,{"$f":"round_to_even(C30/H30,2)","v":37449.230000000003},38239.429999999957]

{"sheet":"SELIC","index":1,"n_rows":6,"n_cols":8,"rows_kept":6,"cut":false,"hidden":false,"merged":[]}
["Data","Selic diária D-2*","Fator diário","Taxa Selic D-2","* Utilizada no Índice de Atualização."]
["2025-01-15",4.5512999999999998E-2,{"$f":"ROUND((1+D2)^(1/252),8)","v":1.00045513},0.1215,null,null,null,"Atenção:"]
["2025-02-03",4.9036999999999997E-2,{"$f":"ROUND((1+D3)^(1/252),8)","v":1.0004903700000001},0.13150000000000001,null,null,null,"Atualizar a tabela com a taxa disponível no site do BNDES, em Moedas Contratuais, Sigla: TAXA SELIC D-2 (Cód: 015) "]
["2025-03-24",5.2531000000000001E-2,1.00052531,0.14149999999999999,null,null,null,"https://www.bndes.gov.br/SiteBNDES/bndes/bndes_pt/Galerias/Convivencia/Moedas_Contratuais/index.html"]
["2025-05-12",5.4266000000000002E-2,1.00054266,0.14649999999999999,null,null,null,"Se a taxa ainda não tiver sido divulgada, o sistema projeta utilizando a última disponível."]
["2025-06-24",5.5130999999999999E-2,1.0005513100000001,0.14899999999999999]

{"sheet":"Feriados","index":2,"n_rows":662,"n_cols":1,"rows_kept":662,"cut":false,"hidden":false,"merged":[]}
["FERIADOS"]
["2009-01-01"]
["2009-02-23"]
["2009-02-24"]
["2009-04-10"]
["2009-04-21"]
["2009-05-01"]
["2009-06-11"]
["2009-09-07"]
["2009-10-12"]
["2009-11-02"]
["2009-11-15"]
["2009-12-25"]
["2010-01-01"]
["2010-02-15"]
["2010-02-16"]
["2010-04-02"]
["2010-04-21"]
["2010-05-01"]
["2010-06-03"]
["2010-09-07"]
["2010-10-12"]
["2010-11-02"]
["2010-11-15"]
["2010-12-25"]
["2011-01-01"]
["2011-03-07"]
["2011-03-08"]
["2011-04-21"]
["2011-04-22"]
["2011-05-01"]
["2011-06-23"]
["2011-09-07"]
["2011-10-12"]
["2011-11-02"]
["2011-11-15"]
["2011-12-25"]
["2012-01-01"]
["2012-02-20"]
["2012-02-21"]
["2012-04-06"]
["2012-04-21"]
["2012-05-01"]
["2012-06-07"]
["2012-09-07"]
["2012-10-12"]
["2012-11-02"]
["2012-11-15"]
["2012-12-25"]
["2013-01-01"]
["2013-02-11"]
["2013-02-12"]
["2013-03-29"]
["2013-04-21"]
["2013-05-01"]
["2013-05-30"]
["2013-09-07"]
["2013-10-12"]
["2013-11-02"]
["2013-11-15"]
["2013-12-25"]
["2014-01-01"]
["2014-03-03"]
["2014-03-04"]
["2014-04-18"]
["2014-04-21"]
["2014-05-01"]
["2014-06-19"]
["2014-09-07"]
["2014-10-12"]
["2014-11-02"]
["2014-11-15"]
["2014-12-25"]
["2015-01-01"]
["2015-02-16"]
["2015-02-17"]
["2015-04-03"]
["2015-04-21"]
["2015-05-01"]
["2015-06-04"]
["2015-09-07"]
["2015-10-12"]
["2015-11-02"]
["2015-11-15"]
["2015-12-25"]
["2016-01-01"]
["2016-02-08"]
["2016-02-09"]
["2016-03-25"]
["2016-04-21"]
["2016-05-01"]
["2016-05-26"]
["2016-09-07"]
["2016-10-12"]
["2016-11-02"]
["2016-11-15"]
["2016-12-25"]
["2017-01-01"]
["2017-02-27"]
["2017-02-28"]
["2017-04-14"]
["2017-04-21"]
["2017-05-01"]
["2017-06-15"]
["2017-09-07"]
["2017-10-12"]
["2017-11-02"]
["2017-11-15"]
["2017-12-25"]
["2018-01-01"]
["2018-02-12"]
["2018-02-13"]
["2018-03-30"]
["2018-04-21"]
["2018-05-01"]
["2018-05-31"]
["2018-09-07"]
["2018-10-12"]
["2018-11-02"]
["2018-11-15"]
["2018-12-25"]
["2019-01-01"]
["2019-03-04"]
["2019-03-05"]
["2019-04-19"]
["2019-04-21"]
["2019-05-01"]
["2019-06-20"]
["2019-09-07"]
["2019-10-12"]
["2019-11-02"]
["2019-11-15"]
["2019-12-25"]
["2020-01-01"]
["2020-02-24"]
["2020-02-25"]
["2020-04-10"]
["2020-04-21"]
["2020-05-01"]
["2020-06-11"]
["2020-09-07"]
["2020-10-12"]
["2020-11-02"]
["2020-11-15"]
["2020-12-25"]
["2021-01-01"]
["2021-02-15"]
["2021-02-16"]
["2021-04-02"]
["2021-04-21"]
["2021-05-01"]
["2021-06-03"]
["2021-09-07"]
["2021-10-12"]
["2021-11-02"]
["2021-11-15"]
["2021-12-25"]
["2022-01-01"]
["2022-02-28"]
["2022-03-01"]
["2022-04-15"]
["2022-04-21"]
["2022-05-01"]
["2022-06-16"]
["2022-09-07"]
["2022-10-12"]
["2022-11-02"]
["2022-11-15"]
["2022-12-25"]
["2023-01-01"]
["2023-02-20"]
["2023-02-21"]
["2023-04-07"]
["2023-04-21"]
["2023-05-01"]
["2023-06-08"]
["2023-09-07"]
["2023-10-12"]
["2023-11-02"]
["2023-11-15"]
["2023-12-25"]
["2024-01-01"]
["2024-02-12"]
["2024-02-13"]
["2024-03-29"]
["2024-04-21"]
["2024-05-01"]
["2024-05-30"]
["2024-09-07"]
["2024-10-12"]
["2024-11-02"]
["2024-11-15"]
["2024-11-20"]
["2024-12-25"]
["2025-01-01"]
["2025-03-03"]
["2025-03-04"]
["2025-04-18"]
["2025-04-21"]
["2025-05-01"]
["2025-06-19"]
["2025-09-07"]
["2025-10-12"]
["2025-11-02"]
["2025-11-15"]
["2025-11-20"]
["2025-12-25"]
["2026-01-01"]
["2026-02-16"]
["2026-02-17"]
["2026-04-03"]
["2026-04-21"]
["2026-05-01"]
["2026-06-04"]
["2026-09-07"]
["2026-10-12"]
["2026-11-02"]
["2026-11-15"]
["2026-11-20"]
["2026-12-25"]
["2027-01-01"]
["2027-02-08"]
["2027-02-09"]
["2027-03-26"]
["2027-04-21"]
["2027-05-01"]
["2027-05-27"]
["2027-09-07"]
["2027-10-12"]
["2027-11-02"]
["2027-11-15"]
["2027-11-20"]
["2027-12-25"]
["2028-01-01"]
["2028-02-28"]
["2028-02-29"]
["2028-04-14"]
["2028-04-21"]
["2028-05-01"]
["2028-06-15"]
["2028-09-07"]
["2028-10-12"]
["2028-11-02"]
["2028-11-15"]
["2028-11-20"]
["2028-12-25"]
["2029-01-01"]
["2029-02-12"]
["2029-02-13"]
["2029-03-30"]
["2029-04-21"]
["2029-05-01"]
["2029-05-31"]
["2029-09-07"]
["2029-10-12"]
["2029-11-02"]
["2029-11-15"]
["2029-11-20"]
["2029-12-25"]
["2030-01-01"]
["2030-03-04"]
["2030-03-05"]
["2030-04-19"]
["2030-04-21"]
["2030-05-01"]
["2030-06-20"]
["2030-09-07"]
["2030-10-12"]
["2030-11-02"]
["2030-11-15"]
["2030-11-20"]
["2030-12-25"]
["2031-01-01"]
["2031-02-24"]
["2031-02-25"]
["2031-04-11"]
["2031-04-21"]
["2031-05-01"]
["2031-06-12"]
["2031-09-07"]
["2031-10-12"]
["2031-11-02"]
["2031-11-15"]
["2031-11-20"]
["2031-12-25"]
["2032-01-01"]
["2032-02-09"]
["2032-02-10"]
["2032-03-26"]
["2032-04-21"]
["2032-05-01"]
["2032-05-27"]
["2032-09-07"]
["2032-10-12"]
["2032-11-02"]
["2032-11-15"]
["2032-11-20"]
["2032-12-25"]
["2033-01-01"]
["2033-02-28"]
["2033-03-01"]
["2033-04-15"]
["2033-04-21"]
["2033-05-01"]
["2033-06-16"]
["2033-09-07"]
["2033-10-12"]
["2033-11-02"]
["2033-11-15"]
["2033-11-20"]
["2033-12-25"]
["2034-01-01"]
["2034-02-20"]
["2034-02-21"]
["2034-04-07"]
["2034-04-21"]
["2034-05-01"]
["2034-06-08"]
["2034-09-07"]
["2034-10-12"]
["2034-11-02"]
["2034-11-15"]
["2034-11-20"]
["2034-12-25"]
["2035-01-01"]
["2035-02-05"]
["2035-02-06"]
["2035-03-23"]
["2035-04-21"]
["2035-05-01"]
["2035-05-24"]
["2035-09-07"]
["2035-10-12"]
["2035-11-02"]
["2035-11-15"]
["2035-11-20"]
["2035-12-25"]
["2036-01-01"]
["2036-02-25"]
["2036-02-26"]
["2036-04-11"]
["2036-04-21"]
["2036-05-01"]
["2036-06-12"]
["2036-09-07"]
["2036-10-12"]
["2036-11-02"]
["2036-11-15"]
["2036-11-20"]
["2036-12-25"]
["2037-01-01"]
["2037-02-16"]
["2037-02-17"]
["2037-04-03"]
["2037-04-21"]
["2037-05-01"]
["2037-06-04"]
["2037-09-07"]
["2037-10-12"]
["2037-11-02"]
["2037-11-15"]
["2037-11-20"]
["2037-12-25"]
["2038-01-01"]
["2038-03-08"]
["2038-03-09"]
["2038-04-23"]
["2038-04-21"]
["2038-05-01"]
["2038-06-24"]
["2038-09-07"]
["2038-10-12"]
["2038-11-02"]
["2038-11-15"]
["2038-11-20"]
["2038-12-25"]
["2039-01-01"]
["2039-02-21"]
["2039-02-22"]
["2039-04-08"]
["2039-04-21"]
["2039-05-01"]
["2039-06-09"]
["2039-09-07"]
["2039-10-12"]
["2039-11-02"]
["2039-11-15"]
["2039-11-20"]
["2039-12-25"]
["2040-01-01"]
["2040-02-13"]
["2040-02-14"]
["2040-03-30"]
["2040-04-21"]
["2040-05-01"]
["2040-05-31"]
["2040-09-07"]
["2040-10-12"]
["2040-11-02"]
["2040-11-15"]
{"$rows_left_out":262}