{"text_format":"1","workbook":"xlsx","n_sheets":3,"sheets":["Modelo","SELIC","Feriados"],"not_rendered":{"charts":0,"images":1,"macros":1,"external_links":0,"defined_names":1,"comments":0,"pivot_tables":0},"unopened":[],"bounds":{"document_bytes":16777216,"sheet_cells":100000,"rows_first":2000,"rows_last":500,"rows_between":2000,"halvings":0,"cell_chars":16384,"cell_head_chars":4096},"cells_cut":0,"cells_raw":0,"read":"whole","date_system":"1900"}

{"sheet":"Modelo","index":0,"n_rows":26,"n_cols":10,"rows_kept":26,"cut":false,"hidden":false,"merged":[[11,9,12,9],[4,0,4,9],[11,0,12,0],[11,1,12,1],[11,2,12,2],[11,3,11,6],[11,7,11,8]]}
[]
[]
[]
[]
["MODELO - Deve ser adaptado utilizando os valores, taxas e prazos do contrato"]
[]
["Valores em Reais"]
["Data Saldo","Saldo"]
["2022-10-17",10000000]
[]
["Valores em Reais"]
["Data de Vencimento","Índice de \nAtualização","Principal\nAtualizado","Juros Compensatórios",null,null,null,"Amortização",null,"Prestação"]
[null,null,null,"Taxa ","Dias Úteis\n*","Multiplicador   ","Juros Compensatórios","N° de Parcelas Restantes\nRestantes","Valor"]
["2022-11-16",{"$f":"(1+VLOOKUP(A9,SELIC!$A$2:$B$325,2,2)%)^E14","v":1.0102067586649572},{"$f":"round_to_even((B9)*ROUND(B14,15),2)","v":10102067.59},1.1000000000000001,{"$f":"NETWORKDAYS(A9,A14-1,feriados)","v":20},{"$f":"ROUND(B14*((1+D14%)^(E14/252)),15)","v":1.01108425077028},{"$f":"round_to_even((B9)*F14,2)-C14","v":8774.9199999999255},261,{"$f":"round_to_even(C14/H14,2)","v":38705.24},{"$f":"I14+G14","v":47480.159999999923}]
["2022-12-15",{"$f":"(1+VLOOKUP(A14,SELIC!$A$2:$B$325,2,2)%)^E15","v":1.0107198224735481},{"$f":"round_to_even((C14-I14)*ROUND(B15,15),2)","v":10171239.810000001},{"$f":"D14","v":1.1000000000000001},{"$f":"NETWORKDAYS(A14,A15-1,feriados)","v":21},{"$f":"ROUND(B15*((1+D15%)^(E15/252)),15)","v":1.0116416771406},{"$f":"round_to_even((C14-I14)*F15,2)-C15","v":9276.9599999990314},{"$f":"H14-1","v":260},{"$f":"round_to_even(C15/H15,2)","v":39120.15},{"$f":"I15+G15","v":48397.109999999033}]
["2023-01-16",{"$f":"(1+VLOOKUP(A15,SELIC!$A$2:$B$325,2,2)%)^E16","v":1.011233146856986},{"$f":"round_to_even((C15-I15)*ROUND(B16,15),2)","v":10245935.25},{"$f":"D15","v":1.1000000000000001},22,{"$f":"ROUND(B16*((1+D16%)^(E16/252)),15)","v":1.01219941082869},{"$f":"round_to_even((C15-I15)*F16,2)-C16","v":9790.3000000007451},{"$f":"H15-1","v":259},{"$f":"round_to_even(C16/H16,2)","v":39559.599999999999},{"$f":"I16+G16","v":49349.900000000744}]
["2023-02-15",{"$f":"(1+VLOOKUP(A16,SELIC!$A$2:$B$325,2,2)%)^E17","v":1.011233146856986},{"$f":"round_to_even((C16-I16)*ROUND(B17,15),2)","v":10321025.369999999},1.1000000000000001,22,1.01219941082869,{"$f":"round_to_even((C16-I16)*F17,2)-C17","v":9862.0500000007451},258,{"$f":"round_to_even(C17/H17,2)","v":40003.97},49866.020000000746]
["2023-03-15",{"$f":"(1+VLOOKUP(A17,SELIC!$A$2:$B$325,2,2)%)^E18","v":1.0091814122432901},{"$f":"round_to_even((C17-I17)*ROUND(B18,15),2)","v":10375415.699999999},1.1000000000000001,18,1.0099703193056999,{"$f":"round_to_even((C17-I17)*F18,2)-C18","v":8110.7700000014156},257,{"$f":"round_to_even(C18/H18,2)","v":40371.269999999997},48482.040000001412]
["2023-03-27",{"$f":"(1+VLOOKUP(A18,SELIC!$A$2:$B$325,2,2)%)^E19","v":1.0040702697195056},{"$f":"((C18-I18)*ROUND(B19,15))","v":10377110.84839322},{"$f":"D18","v":1.1000000000000001},8,1.0044190435676701,{"$f":"ROUND((C18-I18)*F19,15)-C19","v":3604.5932167787105}]
["2023-04-17",{"$f":"(1+VLOOKUP(A19,SELIC!$A$2:$B$325,2,2)%)^E20","v":1.00713384048258},{"$f":"round_to_even((C19-I19)*ROUND(B20,15),2)","v":10451139.5},{"$f":"D18","v":1.1000000000000001},14,1.00774613674527,{"$f":"round_to_even((C19-I19+G19)*F20,2)-C20","v":9986.3800000008196},{"$f":"H18-1","v":256},{"$f":"round_to_even(C20/H20,2)","v":40824.76},{"$f":"I20+G20","v":50811.140000000822}]
["2023-05-08",{"$f":"(1+VLOOKUP(A20,SELIC!$A$2:$B$325,2,2)%)^E21","v":1.0066225969980169},{"$f":"((C20-I20)*ROUND(B21,15))","v":10479258.059145568},{"$f":"D20","v":1.1000000000000001},13,{"$f":"ROUND(B21*((1+D21%)^(E21/252)),15)","v":1.00719085686317},{"$f":"ROUND((C20-I20)*F21,15)-C21","v":5915.7640503328294}]
["2023-05-15",{"$f":"(1+VLOOKUP(A21,SELIC!$A$2:$B$325,2,2)%)^E22","v":1.002541980731313},{"$f":"round_to_even((C21-I21)*ROUND(B22,15),2)","v":10505896.130000001},{"$f":"D20","v":1.1000000000000001},5,1.00275961842147,{"$f":"round_to_even((C21-I21+G21)*F22,2)-C22","v":8212.769999999553},{"$f":"H20-1","v":255},{"$f":"round_to_even(C22/H22,2)","v":41199.589999999997},{"$f":"I22+G22","v":49412.359999999549}]
["2023-06-15",{"$f":"(1+VLOOKUP(A22,SELIC!$A$2:$B$325,2,2)%)^E23","v":1.011233146856986},{"$f":"round_to_even((C22-I22)*ROUND(B23,15),2)","v":10582248.01},1.1000000000000001,22,1.01219941082869,{"$f":"round_to_even((C22-I22)*F23,2)-C23","v":10111.660000000149},254,{"$f":"round_to_even(C23/H23,2)","v":41662.39},51774.050000000148]
["2023-06-26",{"$f":"(1+VLOOKUP(A23,SELIC!$A$2:$B$325,2,2)%)^E24","v":1.0035605813714388},{"$f":"((C23-I23)*ROUND(B24,15))","v":10578116.232802641},{"$f":"D23","v":1.1000000000000001},7,{"$f":"ROUND(B24*((1+D24%)^(E24/252)),15)","v":1.0038655969527299},{"$f":"ROUND((C23-I23)*F24,15)-C24","v":3215.0428500585258}]
["2023-07-17",{"$f":"(1+VLOOKUP(A24,SELIC!$A$2:$B$325,2,2)%)^E25","v":1.0076453436174844},{"$f":"round_to_even((C24-I24)*ROUND(B25,15),2)","v":10658989.57},{"$f":"D23","v":1.1000000000000001},15,1.0083017227617499,{"$f":"round_to_even((C24-I24+G24)*F25,2)-C25","v":10184.980000000447},{"$f":"H23-1","v":253},{"$f":"round_to_even(C25/H25,2)","v":42130.39},{"$f":"I25+G25","v":52315.370000000446}]
["continua..."]

{"sheet":"SELIC","index":1,"n_rows":325,"n_cols":7,"rows_kept":325,"cut":false,"hidden":false,"merged":[]}
["Data","Selic diária D-2*","* Utilizada no Índice de Atualização."]
["2022-09-15",5.0788E-2,null,null,null,null,"Atenção:"]
["2022-09-16",5.0788E-2,null,null,null,null,"Atualizar a tabela com a taxa disponível no site do BNDES, em Moedas Contratuais, Sigla: TAXA SELIC D-2 (Cód: 015) "]
["2022-09-19",5.0788E-2,null,null,null,null,"https://www.bndes.gov.br/SiteBNDES/bndes/bndes_pt/Galerias/Convivencia/Moedas_Contratuais/index.html"]
["2022-09-20",5.0788E-2,null,null,null,null,"Se a taxa ainda não tiver sido divulgada, o sistema projeta utilizando a última disponível."]
["2022-09-21",5.0788E-2]
["2022-09-22",5.0788E-2]
["2022-09-23",5.0788E-2]
["2022-09-26",5.0788E-2]
["2022-09-27",5.0788E-2]
["2022-09-28",5.0788E-2]
["2022-09-29",5.0788E-2]
["2022-09-30",5.0788E-2]
["2022-10-03",5.0788E-2]
["2022-10-04",5.0788E-2]
["2022-10-05",5.0788E-2]
["2022-10-06",5.0788E-2]
["2022-10-07",5.0788E-2]
["2022-10-10",5.0788E-2]
["2022-10-11",5.0788E-2]
["2022-10-13",5.0788E-2]
["2022-10-14",5.0788E-2]
["2022-10-17",5.0788E-2]
["2022-10-18",5.0788E-2]
["2022-10-19",5.0788E-2]
["2022-10-20",5.0788E-2]
["2022-10-21",5.0788E-2]
["2022-10-24",5.0788E-2]
["2022-10-25",5.0788E-2]
["2022-10-26",5.0788E-2]
["2022-10-27",5.0788E-2]
["2022-10-28",5.0788E-2]
["2022-10-31",5.0788E-2]
["2022-11-01",5.0788E-2]
["2022-11-03",5.0788E-2]
["2022-11-04",5.0788E-2]
["2022-11-07",5.0788E-2]
["2022-11-08",5.0788E-2]
["2022-11-09",5.0788E-2]
["2022-11-10",5.0788E-2]
["2022-11-11",5.0788E-2]
["2022-11-14",5.0788E-2]
["2022-11-15",5.0788E-2]
["2022-11-16",5.0788E-2]
["2022-11-17",5.0788E-2]
["2022-11-18",5.0788E-2]
["2022-11-21",5.0788E-2]
["2022-11-22",5.0788E-2]
["2022-11-23",5.0788E-2]
["2022-11-24",5.0788E-2]
["2022-11-25",5.0788E-2]
["2022-11-28",5.0788E-2]
["2022-11-29",5.0788E-2]
["2022-11-30",5.0788E-2]
["2022-12-01",5.0788E-2]
["2022-12-02",5.0788E-2]
["2022-12-05",5.0788E-2]
["2022-12-06",5.0788E-2]
["2022-12-07",5.0788E-2]
["2022-12-08",5.0788E-2]
["2022-12-09",5.0788E-2]
["2022-12-12",5.0788E-2]
["2022-12-13",5.0788E-2]
["2022-12-14",5.0788E-2]
["2022-12-15",5.0788E-2]
["2022-12-16",5.0788E-2]
["2022-12-19",5.0788E-2]
["2022-12-20",5.0788E-2]
["2022-12-21",5.0788E-2]
["2022-12-22",5.0788E-2]
["2022-12-23",5.0788E-2]
["2022-12-26",5.0788E-2]
["2022-12-27",5.0788E-2]
["2022-12-28",5.0788E-2]
["2022-12-29",5.0788E-2]
["2022-12-30",5.0788E-2]
["2023-01-02",5.0788E-2]
["2023-01-03",5.0788E-2]
["2023-01-04",5.0788E-2]
["2023-01-05",5.0788E-2]
["2023-01-06",5.0788E-2]
["2023-01-09",5.0788E-2]
["2023-01-10",5.0788E-2]
["2023-01-11",5.0788E-2]
["2023-01-12",5.0788E-2]
["2023-01-13",5.0788E-2]
["2023-01-16",5.0788E-2]
["2023-01-17",5.0788E-2]
["2023-01-18",5.0788E-2]
["2023-01-19",5.0788E-2]
["2023-01-20",5.0788E-2]
["2023-01-23",5.0788E-2]
["2023-01-24",5.0788E-2]
["2023-01-25",5.0788E-2]
["2023-01-26",5.0788E-2]
["2023-01-27",5.0788E-2]
["2023-01-30",5.0788E-2]
["2023-01-31",5.0788E-2]
["2023-02-01",5.0788E-2]
["2023-02-02",5.0788E-2]
["2023-02-03",5.0788E-2]
["2023-02-06",5.0788E-2]
["2023-02-07",5.0788E-2]
["2023-02-08",5.0788E-2]
["2023-02-09",5.0788E-2]
["2023-02-10",5.0788E-2]
["2023-02-13",5.0788E-2]
["2023-02-14",5.0788E-2]
["2023-02-15",5.0788E-2]
["2023-02-16",5.0788E-2]
["2023-02-17",5.0788E-2]
["2023-02-22",5.0788E-2]
["2023-02-23",5.0788E-2]
["2023-02-24",5.0788E-2]
["2023-02-27",5.0788E-2]
["2023-02-28",5.0788E-2]
["2023-03-01",5.0788E-2]
["2023-03-02",5.0788E-2]
["2023-03-03",5.0788E-2]
["2023-03-06",5.0788E-2]
["2023-03-07",5.0788E-2]
["2023-03-08",5.0788E-2]
["2023-03-09",5.0788E-2]
["2023-03-10",5.0788E-2]
["2023-03-13",5.0788E-2]
["2023-03-14",5.0788E-2]
["2023-03-15",5.0788E-2]
["2023-03-16",5.0788E-2]
["2023-03-17",5.0788E-2]
["2023-03-20",5.0788E-2]
["2023-03-21",5.0788E-2]
["2023-03-22",5.0788E-2]
["2023-03-23",{"$f":"B132","v":5.0788E-2}]
["2023-03-24",{"$f":"B133","v":5.0788E-2}]
["2023-03-27",5.0788E-2]
["2023-03-28",5.0788E-2]
["2023-03-29",5.0788E-2]
["2023-03-30",5.0788E-2]
["2023-03-31",5.0788E-2]
["2023-04-03",5.0788E-2]
["2023-04-04",5.0788E-2]
["2023-04-05",5.0788E-2]
["2023-04-06",5.0788E-2]
["2023-04-10",5.0788E-2]
["2023-04-11",5.0788E-2]
["2023-04-12",5.0788E-2]
["2023-04-13",5.0788E-2]
["2023-04-14",5.0788E-2]
["2023-04-17",5.0788E-2]
["2023-04-18",5.0788E-2]
["2023-04-19",5.0788E-2]
["2023-04-20",5.0788E-2]
["2023-04-24",5.0788E-2]
["2023-04-25",5.0788E-2]
["2023-04-26",5.0788E-2]
["2023-04-27",5.0788E-2]
["2023-04-28",5.0788E-2]
["2023-05-02",5.0788E-2]
["2023-05-03",5.0788E-2]
["2023-05-04",5.0788E-2]
["2023-05-05",5.0788E-2]
["2023-05-08",5.0788E-2]
["2023-05-09",5.0788E-2]
["2023-05-10",5.0788E-2]
["2023-05-11",5.0788E-2]
["2023-05-12",5.0788E-2]
["2023-05-15",5.0788E-2]
["2023-05-16",5.0788E-2]
["2023-05-17",5.0788E-2]
["2023-05-18",5.0788E-2]
["2023-05-19",5.0788E-2]
["2023-05-22",5.0788E-2]
["2023-05-23",5.0788E-2]
["2023-05-24",5.0788E-2]
["2023-05-25",5.0788E-2]
["2023-05-26",5.0788E-2]
["2023-05-29",5.0788E-2]
["2023-05-30",5.0788E-2]
["2023-05-31",5.0788E-2]
["2023-06-01",5.0788E-2]
["2023-06-02",5.0788E-2]
["2023-06-05",5.0788E-2]
["2023-06-06",5.0788E-2]
["2023-06-07",5.0788E-2]
["2023-06-09",5.0788E-2]
["2023-06-12",5.0788E-2]
["2023-06-13",5.0788E-2]
["2023-06-14",5.0788E-2]
["2023-06-15",5.0788E-2]
["2023-06-16",5.0788E-2]
["2023-06-19",5.0788E-2]
["2023-06-20",5.0788E-2]
["2023-06-21",5.0788E-2]
["2023-06-22",5.0788E-2]
["2023-06-23",5.0788E-2]
["2023-06-26",5.0788E-2]
["2023-06-27",5.0788E-2]
["2023-06-28",{"$f":"B197","v":5.0788E-2}]
["2023-06-29",5.0788E-2]
["2023-06-30",5.0788E-2]
["2023-07-03",5.0788E-2]
["2023-07-04",5.0788E-2]
["2023-07-05",5.0788E-2]
["2023-07-06",5.0788E-2]
["2023-07-07",5.0788E-2]
["2023-07-10",5.0788E-2]
["2023-07-11",5.0788E-2]
["2023-07-12",5.0788E-2]
["2023-07-13",5.0788E-2]
["2023-07-14",5.0788E-2]
["2023-07-17",5.0788E-2]
["2023-07-18",5.0788E-2]
["2023-07-19",5.0788E-2]
["2023-07-20",5.0788E-2]
["2023-07-21",5.0788E-2]
["2023-07-24",5.0788E-2]
["2023-07-25",5.0788E-2]
["2023-07-26",5.0788E-2]
["2023-07-27",5.0788E-2]
["2023-07-28",5.0788E-2]
["2023-07-31",5.0788E-2]
["2023-08-01",5.0788E-2]
["2023-08-02",5.0788E-2]
["2023-08-03",5.0788E-2]
["2023-08-04",5.0788E-2]
["2023-08-07",5.0788E-2]
["2023-08-08",5.0788E-2]
["2023-08-09",5.0788E-2]
["2023-08-10",5.0788E-2]
["2023-08-11",5.0788E-2]
["2023-08-14",5.0788E-2]
["2023-08-15",5.0788E-2]
["2023-08-16",5.0788E-2]
["2023-08-17",5.0788E-2]
["2023-08-18",5.0788E-2]
["2023-08-21",5.0788E-2]
["2023-08-22",5.0788E-2]
["2023-08-23",5.0788E-2]
["2023-08-24",5.0788E-2]
["2023-08-25",5.0788E-2]
["2023-08-28",5.0788E-2]
["2023-08-29",5.0788E-2]
["2023-08-30",5.0788E-2]
["2023-08-31",5.0788E-2]
["2023-09-01",5.0788E-2]
["2023-09-04",5.0788E-2]
["2023-09-05",5.0788E-2]
["2023-09-06",5.0788E-2]
["2023-09-08",5.0788E-2]
["2023-09-11",5.0788E-2]
["2023-09-12",5.0788E-2]
["2023-09-13",5.0788E-2]
["2023-09-14",5.0788E-2]
["2023-09-15",5.0788E-2]
["2023-09-18",5.0788E-2]
["2023-09-19",5.0788E-2]
["2023-09-20",5.0788E-2]
["2023-09-21",5.0788E-2]
["2023-09-22",5.0788E-2]
["2023-09-25",5.0788E-2]
["2023-09-26",5.0788E-2]
["2023-09-27",{"$f":"B261","v":5.0788E-2}]
["2023-09-28",5.0788E-2]
["2023-09-29",5.0788E-2]
["2023-10-02",5.0788E-2]
["2023-10-03",5.0788E-2]
["2023-10-04",5.0788E-2]
["2023-10-05",5.0788E-2]
["2023-10-06",5.0788E-2]
["2023-10-09",5.0788E-2]
["2023-10-10",5.0788E-2]
["2023-10-11",5.0788E-2]
["2023-10-13",5.0788E-2]
["2023-10-16",5.0788E-2]
["2023-10-17",5.0788E-2]
["2023-10-18",5.0788E-2]
["2023-10-19",5.0788E-2]
["2023-10-20",5.0788E-2]
["2023-10-23",5.0788E-2]
["2023-10-24",5.0788E-2]
["2023-10-25",5.0788E-2]
["2023-10-26",5.0788E-2]
["2023-10-27",5.0788E-2]
["2023-10-30",5.0788E-2]
["2023-10-31",5.0788E-2]
["2023-11-01",5.0788E-2]
["2023-11-03",5.0788E-2]
["2023-11-06",5.0788E-2]
["2023-11-07",5.0788E-2]
["2023-11-08",5.0788E-2]
["2023-11-09",5.0788E-2]
["2023-11-10",5.0788E-2]
["2023-11-13",5.0788E-2]
["2023-11-14",5.0788E-2]
["2023-11-16",5.0788E-2]
["2023-11-17",5.0788E-2]
["2023-11-20",5.0788E-2]
["2023-11-21",5.0788E-2]
["2023-11-22",5.0788E-2]
["2023-11-23",5.0788E-2]
["2023-11-24",5.0788E-2]
["2023-11-27",5.0788E-2]
["2023-11-28",5.0788E-2]
["2023-11-29",5.0788E-2]
["2023-11-30",5.0788E-2]
["2023-12-01",5.0788E-2]
["2023-12-04",5.0788E-2]
["2023-12-05",5.0788E-2]
["2023-12-06",5.0788E-2]
["2023-12-07",5.0788E-2]
["2023-12-08",5.0788E-2]
["2023-12-11",5.0788E-2]
["2023-12-12",5.0788E-2]
["2023-12-13",5.0788E-2]
["2023-12-14",5.0788E-2]
["2023-12-15",5.0788E-2]
["2023-12-18",5.0788E-2]
["2023-12-19",5.0788E-2]
["2023-12-20",5.0788E-2]
["2023-12-21",5.0788E-2]
["2023-12-22",5.0788E-2]
["2023-12-26",5.0788E-2]
["2023-12-27",5.0788E-2]
["2023-12-28",5.0788E-2]
["2023-12-29",5.0788E-2]

{"sheet":"Feriados","index":2,"n_rows":662,"n_cols":1,"rows_kept":662,"cut":false,"hidden":false,"merged":[]}
["FERIADOS"]
["2009-01-01"]
["2009-02-23"]
["2009-02-24"]
["2009-04-10"]
["2009-04-21"]
["2009-05-01"]
["2009-06-11"]
["2009-09-07"]
["2009-10-12"]
["2009-11-02"]
["2009-11-15"]
["2009-12-25"]
["2010-01-01"]
["2010-02-15"]
["2010-02-16"]
["2010-04-02"]
["2010-04-21"]
["2010-05-01"]
["2010-06-03"]
["2010-09-07"]
["2010-10-12"]
["2010-11-02"]
["2010-11-15"]
["2010-12-25"]
["2011-01-01"]
["2011-03-07"]
["2011-03-08"]
["2011-04-21"]
["2011-04-22"]
["2011-05-01"]
["2011-06-23"]
["2011-09-07"]
["2011-10-12"]
["2011-11-02"]
["2011-11-15"]
["2011-12-25"]
["2012-01-01"]
["2012-02-20"]
["2012-02-21"]
["2012-04-06"]
["2012-04-21"]
["2012-05-01"]
["2012-06-07"]
["2012-09-07"]
["2012-10-12"]
["2012-11-02"]
["2012-11-15"]
["2012-12-25"]
["2013-01-01"]
["2013-02-11"]
["2013-02-12"]
["2013-03-29"]
["2013-04-21"]
["2013-05-01"]
["2013-05-30"]
["2013-09-07"]
["2013-10-12"]
["2013-11-02"]
["2013-11-15"]
["2013-12-25"]
["2014-01-01"]
["2014-03-03"]
["2014-03-04"]
["2014-04-18"]
["2014-04-21"]
["2014-05-01"]
["2014-06-19"]
["2014-09-07"]
["2014-10-12"]
["2014-11-02"]
["2014-11-15"]
["2014-12-25"]
["2015-01-01"]
["2015-02-16"]
["2015-02-17"]
["2015-04-03"]
["2015-04-21"]
["2015-05-01"]
["2015-06-04"]
["2015-09-07"]
["2015-10-12"]
["2015-11-02"]
["2015-11-15"]
["2015-12-25"]
["2016-01-01"]
["2016-02-08"]
["2016-02-09"]
["2016-03-25"]
["2016-04-21"]
["2016-05-01"]
["2016-05-26"]
["2016-09-07"]
["2016-10-12"]
["2016-11-02"]
["2016-11-15"]
["2016-12-25"]
["2017-01-01"]
["2017-02-27"]
["2017-02-28"]
["2017-04-14"]
["2017-04-21"]
["2017-05-01"]
["2017-06-15"]
["2017-09-07"]
["2017-10-12"]
["2017-11-02"]
["2017-11-15"]
["2017-12-25"]
["2018-01-01"]
["2018-02-12"]
["2018-02-13"]
["2018-03-30"]
["2018-04-21"]
["2018-05-01"]
["2018-05-31"]
["2018-09-07"]
["2018-10-12"]
["2018-11-02"]
["2018-11-15"]
["2018-12-25"]
["2019-01-01"]
["2019-03-04"]
["2019-03-05"]
["2019-04-19"]
["2019-04-21"]
["2019-05-01"]
["2019-06-20"]
["2019-09-07"]
["2019-10-12"]
["2019-11-02"]
["2019-11-15"]
["2019-12-25"]
["2020-01-01"]
["2020-02-24"]
["2020-02-25"]
["2020-04-10"]
["2020-04-21"]
["2020-05-01"]
["2020-06-11"]
["2020-09-07"]
["2020-10-12"]
["2020-11-02"]
["2020-11-15"]
["2020-12-25"]
["2021-01-01"]
["2021-02-15"]
["2021-02-16"]
["2021-04-02"]
["2021-04-21"]
["2021-05-01"]
["2021-06-03"]
["2021-09-07"]
["2021-10-12"]
["2021-11-02"]
["2021-11-15"]
["2021-12-25"]
["2022-01-01"]
["2022-02-28"]
["2022-03-01"]
["2022-04-15"]
["2022-04-21"]
["2022-05-01"]
["2022-06-16"]
["2022-09-07"]
["2022-10-12"]
["2022-11-02"]
["2022-11-15"]
["2022-12-25"]
["2023-01-01"]
["2023-02-20"]
["2023-02-21"]
["2023-04-07"]
["2023-04-21"]
["2023-05-01"]
["2023-06-08"]
["2023-09-07"]
["2023-10-12"]
["2023-11-02"]
["2023-11-15"]
["2023-12-25"]
["2024-01-01"]
["2024-02-12"]
["2024-02-13"]
["2024-03-29"]
["2024-04-21"]
["2024-05-01"]
["2024-05-30"]
["2024-09-07"]
["2024-10-12"]
["2024-11-02"]
["2024-11-15"]
["2024-11-20"]
["2024-12-25"]
["2025-01-01"]
["2025-03-03"]
["2025-03-04"]
["2025-04-18"]
["2025-04-21"]
["2025-05-01"]
["2025-06-19"]
["2025-09-07"]
["2025-10-12"]
["2025-11-02"]
["2025-11-15"]
["2025-11-20"]
["2025-12-25"]
["2026-01-01"]
["2026-02-16"]
["2026-02-17"]
["2026-04-03"]
["2026-04-21"]
["2026-05-01"]
["2026-06-04"]
["2026-09-07"]
["2026-10-12"]
["2026-11-02"]
["2026-11-15"]
["2026-11-20"]
["2026-12-25"]
["2027-01-01"]
["2027-02-08"]
["2027-02-09"]
["2027-03-26"]
["2027-04-21"]
["2027-05-01"]
["2027-05-27"]
["2027-09-07"]
["2027-10-12"]
["2027-11-02"]
["2027-11-15"]
["2027-11-20"]
["2027-12-25"]
["2028-01-01"]
["2028-02-28"]
["2028-02-29"]
["2028-04-14"]
["2028-04-21"]
["2028-05-01"]
["2028-06-15"]
["2028-09-07"]
["2028-10-12"]
["2028-11-02"]
["2028-11-15"]
["2028-11-20"]
["2028-12-25"]
["2029-01-01"]
["2029-02-12"]
["2029-02-13"]
["2029-03-30"]
["2029-04-21"]
["2029-05-01"]
["2029-05-31"]
["2029-09-07"]
["2029-10-12"]
["2029-11-02"]
["2029-11-15"]
["2029-11-20"]
["2029-12-25"]
["2030-01-01"]
["2030-03-04"]
["2030-03-05"]
["2030-04-19"]
["2030-04-21"]
["2030-05-01"]
["2030-06-20"]
["2030-09-07"]
["2030-10-12"]
["2030-11-02"]
["2030-11-15"]
["2030-11-20"]
["2030-12-25"]
["2031-01-01"]
["2031-02-24"]
["2031-02-25"]
["2031-04-11"]
["2031-04-21"]
["2031-05-01"]
["2031-06-12"]
["2031-09-07"]
["2031-10-12"]
["2031-11-02"]
["2031-11-15"]
["2031-11-20"]
["2031-12-25"]
["2032-01-01"]
["2032-02-09"]
["2032-02-10"]
["2032-03-26"]
["2032-04-21"]
["2032-05-01"]
["2032-05-27"]
["2032-09-07"]
["2032-10-12"]
["2032-11-02"]
["2032-11-15"]
["2032-11-20"]
["2032-12-25"]
["2033-01-01"]
["2033-02-28"]
["2033-03-01"]
["2033-04-15"]
["2033-04-21"]
["2033-05-01"]
["2033-06-16"]
["2033-09-07"]
["2033-10-12"]
["2033-11-02"]
["2033-11-15"]
["2033-11-20"]
["2033-12-25"]
["2034-01-01"]
["2034-02-20"]
["2034-02-21"]
["2034-04-07"]
["2034-04-21"]
["2034-05-01"]
["2034-06-08"]
["2034-09-07"]
["2034-10-12"]
["2034-11-02"]
["2034-11-15"]
["2034-11-20"]
["2034-12-25"]
["2035-01-01"]
["2035-02-05"]
["2035-02-06"]
["2035-03-23"]
["2035-04-21"]
["2035-05-01"]
["2035-05-24"]
["2035-09-07"]
["2035-10-12"]
["2035-11-02"]
["2035-11-15"]
["2035-11-20"]
["2035-12-25"]
["2036-01-01"]
["2036-02-25"]
["2036-02-26"]
["2036-04-11"]
["2036-04-21"]
["2036-05-01"]
["2036-06-12"]
["2036-09-07"]
["2036-10-12"]
["2036-11-02"]
["2036-11-15"]
["2036-11-20"]
["2036-12-25"]
["2037-01-01"]
["2037-02-16"]
["2037-02-17"]
["2037-04-03"]
["2037-04-21"]
["2037-05-01"]
["2037-06-04"]
["2037-09-07"]
["2037-10-12"]
["2037-11-02"]
["2037-11-15"]
["2037-11-20"]
["2037-12-25"]
["2038-01-01"]
["2038-03-08"]
["2038-03-09"]
["2038-04-23"]
["2038-04-21"]
["2038-05-01"]
["2038-06-24"]
["2038-09-07"]
["2038-10-12"]
["2038-11-02"]
["2038-11-15"]
["2038-11-20"]
["2038-12-25"]
["2039-01-01"]
["2039-02-21"]
["2039-02-22"]
["2039-04-08"]
["2039-04-21"]
["2039-05-01"]
["2039-06-09"]
["2039-09-07"]
["2039-10-12"]
["2039-11-02"]
["2039-11-15"]
["2039-11-20"]
["2039-12-25"]
["2040-01-01"]
["2040-02-13"]
["2040-02-14"]
["2040-03-30"]
["2040-04-21"]
["2040-05-01"]
["2040-05-31"]
["2040-09-07"]
["2040-10-12"]
["2040-11-02"]
["2040-11-15"]
{"$rows_left_out":262}